|
From: Markella K. <chr...@fr...> - 2005-08-02 15:44:05
|
Hi to everybody!
My version is: 4.9.9.2-wx-beta-6.7 on Windows XP Home
What I tryed to compile it: All the example programs in the
DevC++/Examples/gtk2/ directory.
My Compile log is:
//=========== Start Compile log here ============================
Compiler: Default compiler
Building Makefile: "C:\Dev-Cpp\Examples\gtk2\ch7.calculator\Makefile.win"
Finding dependencies for file:
C:\Dev-Cpp\Examples\gtk2\ch7.calculator\calculator.c
Executing make...
make.exe -f "C:\Dev-Cpp\Examples\gtk2\ch7.calculator\Makefile.win" all
gcc.exe -c calculator.c -o calculator.o -I"C:/Dev-Cpp/include"
-I"C:\Dev-Cpp\\include\gtk-2.0"
-I"C:\Dev-Cpp\\include\..\lib\gtk-2.0\include"
-I"C:\Dev-Cpp\\include\atk-1.0" -I"C:\Dev-Cpp\\include\pango-1.0"
-I"C:\Dev-Cpp\\include\glib-2.0"
-I"C:\Dev-Cpp\\include\..\lib\glib-2.0\include" -mms-bitfields
In file included from C:/Dev-Cpp//include/gtk-2.0/gdk/gdk.h:34,
from C:/Dev-Cpp//include/gtk-2.0/gtk/gtk.h:31,
from calculator.c:8:
C:/Dev-Cpp//include/gtk-2.0/gdk/gdkdrawable.h:161: error: syntax error
before "PangoMatrix"
C:/Dev-Cpp//include/gtk-2.0/gdk/gdkdrawable.h:359: error: syntax error
before "PangoMatrix"
In file included from C:/Dev-Cpp//include/gtk-2.0/gdk/gdk.h:43,
from C:/Dev-Cpp//include/gtk-2.0/gtk/gtk.h:31,
from calculator.c:8:
C:/Dev-Cpp//include/gtk-2.0/gdk/gdkpango.h:69: error: syntax error
before "PangoRenderer"
C:/Dev-Cpp//include/gtk-2.0/gdk/gdkpango.h:69: warning: no semicolon at
end of struct or union
C:/Dev-Cpp//include/gtk-2.0/gdk/gdkpango.h:72: error: syntax error
before '}' token
C:/Dev-Cpp//include/gtk-2.0/gdk/gdkpango.h:84: error: syntax error
before "PangoRendererClass"
C:/Dev-Cpp//include/gtk-2.0/gdk/gdkpango.h:84: warning: no semicolon at
end of struct or union
C:/Dev-Cpp//include/gtk-2.0/gdk/gdkpango.h:89: error: syntax error
before '*' token
C:/Dev-Cpp//include/gtk-2.0/gdk/gdkpango.h:89: warning: data definition
has no type or storage class
C:/Dev-Cpp//include/gtk-2.0/gdk/gdkpango.h:90: error: syntax error
before '*' token
C:/Dev-Cpp//include/gtk-2.0/gdk/gdkpango.h:90: warning: data definition
has no type or storage class
C:/Dev-Cpp//include/gtk-2.0/gdk/gdkpango.h:97: error: syntax error
before "PangoRenderPart"
C:/Dev-Cpp//include/gtk-2.0/gdk/gdkpango.h:100: error: syntax error
before "PangoRenderPart"
In file included from C:/Dev-Cpp//include/gtk-2.0/gtk/gtk.h:31,
from calculator.c:8:
C:/Dev-Cpp//include/gtk-2.0/gdk/gdk.h:70: error: syntax error before '*'
token
In file included from C:/Dev-Cpp//include/gtk-2.0/gtk/gtkaccellabel.h:34,
from C:/Dev-Cpp//include/gtk-2.0/gtk/gtk.h:34,
from calculator.c:8:
C:/Dev-Cpp//include/gtk-2.0/gtk/gtklabel.h:130: error: syntax error
before "PangoEllipsizeMode"
C:/Dev-Cpp//include/gtk-2.0/gtk/gtklabel.h:131: error: syntax error
before "gtk_label_get_ellipsize"
C:/Dev-Cpp//include/gtk-2.0/gtk/gtklabel.h:131: warning: data definition
has no type or storage class
In file included from C:/Dev-Cpp//include/gtk-2.0/gtk/gtk.h:114,
from calculator.c:8:
C:/Dev-Cpp//include/gtk-2.0/gtk/gtkmain.h:99: error: syntax error before
"GOptionEntry"
C:/Dev-Cpp//include/gtk-2.0/gtk/gtkmain.h:103: error: syntax error
before '*' token
C:/Dev-Cpp//include/gtk-2.0/gtk/gtkmain.h:103: warning: data definition
has no type or storage class
In file included from C:/Dev-Cpp//include/gtk-2.0/gtk/gtk.h:132,
from calculator.c:8:
C:/Dev-Cpp//include/gtk-2.0/gtk/gtkprogressbar.h:141: error: syntax
error before "PangoEllipsizeMode"
C:/Dev-Cpp//include/gtk-2.0/gtk/gtkprogressbar.h:142: error: syntax
error before "gtk_progress_bar_get_ellipsize"
C:/Dev-Cpp//include/gtk-2.0/gtk/gtkprogressbar.h:142: warning: data
definition has no type or storage class
make.exe: *** [calculator.o] Error 1
Execution terminated
//==================== END OF THE COMILE LOG
======================================
My problem is that I can not use the GTK+ to develop with.
I downloded with the Packege manager everything what is similar to GTK.
It was some requirement when I install the packages so I downloaded
something for the GTK what I think was installed to the c:\Program
Files\Common Files\GTK\2.0\ palce.
My question is that why It's not work?
Krisztian
|